{"text_format":"3","workbook":"xlsx","n_sheets":6,"sheets":["Lists","DTL","DTL (2)","DTL (3)","DTL (4)","DTL (5)"],"not_rendered":{"images":3,"external_links":2,"defined_names":6},"read":"whole","date_system":"1900"}

{"sheet":"Lists","index":0,"n_rows":46,"n_cols":2,"rows_kept":46,"hidden":true}
["Endeavour Code"]
["425 -"]
["851 -"]
["39E -"]
[]
["Program"]
["425 - Community Futures Development Program"]
["851 - Northern Ontario Development Program (NODP)"]
["39E - Economic Development Initiative"]
[]
["PPG"]
["001 - Community Futures - Operating Costs"]
["002 - Community Futures - Investment Fund"]
["003 - Community Futures - Other"]
["110 - Planning and Decision Making"]
["120 - Community Competitiveness-Implementation (Capital)"]
["121 - Community Competitiveness-Implementation (Non-Capital)"]
["130 - Regional Competitiveness-Implementation (Capital)"]
["131 - Regional Competitiveness-Implementation (Non-Capital)"]
["132 - Local Initiatives Contribution - CFDC"]
["135 - CED-Youth Internship (NFP)"]
["210 - Business Management Capacity"]
["220 - Trade Expansion and Export Development"]
["230 - Investment Attraction"]
["240 - Business and Sector Development (Capital)"]
["241 - Business and Sector Development (Non-Capital)"]
["242 - Capitalization of CFDC's"]
["245 - BGC-Youth Internship (NFP)"]
["246 - BGC-Youth Internship (SME)"]
["310 - Applied Research and Development "]
["320 - Innovation Linkages and Cluster Development "]
["330 - Innovation Capacity Building (Capital)"]
["331 - Innovation Capacity Building (Non-Capital)"]
["332 - Innovation Technology Adoption"]
["335 - Innovation - Youth Internship (NFP)"]
["336 - Innovation - Youth Internship (SME)"]
["340 - Targeted Manufacturing Initiative (TMI)"]
[]
["Fiscal Year"]
["(Select Current Year)","Sélectionnez l'année en cours"]
["2014-2015","2014-2015"]
["2015-2016","2015-2016"]
["2016-2017","2016-2017"]
["2017-2018","2017-2018"]
["2018-2019","2018-2019"]
["2019-2020","2019-2020"]

{"sheet":"DTL","index":1,"n_rows":27,"n_cols":8,"rows_kept":27,"merged":[[0,0,0,7],[1,0,1,1],[1,2,1,7],[2,0,2,1],[2,2,2,7],[3,0,3,4],[3,5,3,7],[4,0,4,4],[4,5,4,7],[18,0,18,4],[18,6,18,7]]}
[]
["Claim number:",null,"Project number:"]
[]
["Eligible supported cost category (as per Annex 1 - The Project - Statement of Work):",{"$nulls":4},"Schedule number:"]
[]
["ITEM NUMBER","DATE OF INVOICE          (YYYY-MM-DD)","NAME OF SUPPLIER","DESCRIPTION OF ITEM OR SERVICE PURCHASED","INVOICE NUMBER","AMOUNT \n(Net of HST rebate)","PAYMENT REFERENCE\n(Cheque number)","OFFICIAL USE ONLY"]
{"$rows_empty":12}
["TOTAL",{"$nulls":4},{"$f":"SUM(F7:F18)","v":{"v":0,"d":"$0.00"}}]
[]
[]
[]
[]
["For official use only"]
["I"]
["P"]
["I/P"]

{"sheet":"DTL (2)","index":2,"n_rows":27,"n_cols":8,"rows_kept":27,"merged":[[0,0,0,7],[1,0,1,1],[1,2,1,7],[2,0,2,1],[2,2,2,7],[3,0,3,4],[3,5,3,7],[4,0,4,4],[4,5,4,7],[18,0,18,4],[18,6,18,7]]}
[]
["Claim number:",null,"Project number:"]
[{"$f":"IF(DTL!A3=\"\",\"\",DTL!A3)","v":""},null,{"$f":"IF(DTL!$C$3:$H$3=0,\"\",DTL!$C$3:$H$3)","v":""}]
["Eligible supported cost category (as per Annex 1 - The Project - Statement of Work):",{"$nulls":4},"Schedule number:"]
[]
["ITEM NUMBER","DATE OF INVOICE          (YYYY-MM-DD)","NAME OF SUPPLIER","DESCRIPTION OF ITEM OR SERVICE PURCHASED","INVOICE NUMBER","AMOUNT \n(Net of HST rebate)","PAYMENT REFERENCE\n(Cheque number)","OFFICIAL USE ONLY"]
{"$rows_empty":12}
["TOTAL",{"$nulls":4},{"$f":"SUM(F7:F18)","v":{"v":0,"d":"$0.00"}}]
[]
[]
[]
[]
["For official use only"]
["I"]
["P"]
["I/P"]

{"sheet":"DTL (3)","index":3,"n_rows":27,"n_cols":8,"rows_kept":27,"merged":[[0,0,0,7],[1,0,1,1],[1,2,1,7],[2,0,2,1],[2,2,2,7],[3,0,3,4],[3,5,3,7],[4,0,4,4],[4,5,4,7],[18,0,18,4],[18,6,18,7]]}
[]
["Claim number:",null,"Project number:"]
[{"$f":"IF(DTL!A3=\"\",\"\",DTL!A3)","v":""},null,{"$f":"IF(DTL!$C$3:$H$3=0,\"\",DTL!$C$3:$H$3)","v":""}]
["Eligible supported cost category (as per Annex 1 - The Project - Statement of Work):",{"$nulls":4},"Schedule number:"]
[]
["ITEM NUMBER","DATE OF INVOICE          (YYYY-MM-DD)","NAME OF SUPPLIER","DESCRIPTION OF ITEM OR SERVICE PURCHASED","INVOICE NUMBER","AMOUNT \n(Net of HST rebate)","PAYMENT REFERENCE\n(Cheque number)","OFFICIAL USE ONLY"]
{"$rows_empty":12}
["TOTAL",{"$nulls":4},{"$f":"SUM(F7:F18)","v":{"v":0,"d":"$0.00"}}]
[]
[]
[]
[]
["For official use only"]
["I"]
["P"]
["I/P"]

{"sheet":"DTL (4)","index":4,"n_rows":27,"n_cols":8,"rows_kept":27,"merged":[[0,0,0,7],[1,0,1,1],[1,2,1,7],[2,0,2,1],[2,2,2,7],[3,0,3,4],[3,5,3,7],[4,0,4,4],[4,5,4,7],[18,0,18,4],[18,6,18,7]]}
[]
["Claim number:",null,"Project number:"]
[{"$f":"IF(DTL!A3=\"\",\"\",DTL!A3)","v":""},null,{"$f":"IF(DTL!$C$3:$H$3=0,\"\",DTL!$C$3:$H$3)","v":""}]
["Eligible supported cost category (as per Annex 1 - The Project - Statement of Work):",{"$nulls":4},"Schedule number:"]
[]
["ITEM NUMBER","DATE OF INVOICE          (YYYY-MM-DD)","NAME OF SUPPLIER","DESCRIPTION OF ITEM OR SERVICE PURCHASED","INVOICE NUMBER","AMOUNT \n(Net of HST rebate)","PAYMENT REFERENCE\n(Cheque number)","OFFICIAL USE ONLY"]
{"$rows_empty":12}
["TOTAL",{"$nulls":4},{"$f":"SUM(F7:F18)","v":{"v":0,"d":"$0.00"}}]
[]
[]
[]
[]
["For official use only"]
["I"]
["P"]
["I/P"]

{"sheet":"DTL (5)","index":5,"n_rows":27,"n_cols":8,"rows_kept":27,"merged":[[0,0,0,7],[1,0,1,1],[1,2,1,7],[2,0,2,1],[2,2,2,7],[3,0,3,4],[3,5,3,7],[4,0,4,4],[4,5,4,7],[18,0,18,4],[18,6,18,7]]}
[]
["Claim number:",null,"Project number:"]
[{"$f":"IF(DTL!A3=\"\",\"\",DTL!A3)","v":""},null,{"$f":"IF(DTL!$C$3:$H$3=0,\"\",DTL!$C$3:$H$3)","v":""}]
["Eligible supported cost category (as per Annex 1 - The Project - Statement of Work):",{"$nulls":4},"Schedule number:"]
[]
["ITEM NUMBER","DATE OF INVOICE          (YYYY-MM-DD)","NAME OF SUPPLIER","DESCRIPTION OF ITEM OR SERVICE PURCHASED","INVOICE NUMBER","AMOUNT \n(Net of HST rebate)","PAYMENT REFERENCE\n(Cheque number)","OFFICIAL USE ONLY"]
{"$rows_empty":12}
["TOTAL",{"$nulls":4},{"$f":"SUM(F7:F18)","v":{"v":0,"d":"$0.00"}}]
[]
[]
[]
[]
["For official use only"]
["I"]
["P"]
["I/P"]